{"text_format":"1","workbook":"xlsx","n_sheets":5,"sheets":["Macro1","index","dados_cadastros","historico","cola"],"not_rendered":{"charts":0,"images":2,"macros":1,"external_links":0,"defined_names":0,"comments":0,"pivot_tables":0},"unopened":[],"bounds":{"document_bytes":16777216,"sheet_cells":100000,"rows_first":2000,"rows_last":500,"rows_between":2000,"halvings":0,"cell_chars":16384,"cell_head_chars":4096},"cells_cut":0,"cells_raw":0,"read":"whole","date_system":"1900"}

{"sheet":"Macro1","index":0,"n_rows":0,"n_cols":0,"rows_kept":0,"cut":false,"hidden":false,"merged":[]}

{"sheet":"index","index":1,"n_rows":54,"n_cols":37,"rows_kept":54,"cut":false,"hidden":false,"merged":[[11,9,11,13],[17,0,19,16383],[13,0,16,41],[20,4,20,14],[20,15,20,20],[20,21,20,22],[20,23,20,33],[20,34,20,39],[2,31,2,38],[0,5,0,7],[1,5,2,7],[3,5,3,7],[23,1,23,38],[5,0,6,41],[8,7,8,10],[8,24,8,33],[8,35,8,40],[8,20,8,23],[20,2,20,3],[11,25,11,33],[11,21,11,23],[11,15,11,20],[11,4,11,7],[8,17,8,19]]}
[{"$f":"TODAY()","v":"2015-05-22"},null,null,null,null,null,null,null,1,1,1,1,1,1,1,1,1,1,1,1,1,1,1,1,1,1,1,1,1,1,1]
[null,null,null,null,null,{"$f":"DAY(A1)","v":22}]
[null,null,null,null,null,null,null,null,null,null,null,null,null,null,null,null,null,null,null,null,null,null,null,null,null,null,null,null,null,null,null,"Diretório Central dos Est."]
[null,null,null,null,null,{"$f":"MONTH(A1)&\"/\"&YEAR(A1)","v":"5/2015"}]
[]
["CONTROLE DE PRESENÇA E MOVIMENTAÇÃO DE PARTICIPANTES ALIMENTADO VIA CÓDIGO DE BARRAS DO CRACHÁ."]
[]
[]
[null,"Código de Barras Lido:",null,null,null,null,null,null,null,null,null,null,"Número da Pasta:",null,null,null,null,{"$f":"IFERROR(VLOOKUP(H9,dados_cadastros!A:B,2,0),\"\")","v":""},null,null,"Participante:",null,null,null,{"$f":"IFERROR(VLOOKUP(H9,dados_cadastros!A:C,3,0),\"\")","v":""},null,null,null,null,null,null,null,null,null,null,{"$f":"IFERROR(VLOOKUP(H9,dados_cadastros!A:D,4,0),\"\")","v":""}]
[]
[]
[null,"Dia e Hora:",null,null,{"$f":"NOW()","v":"2015-05-22T20:45:36.450"},null,null,null,"|",{"$f":"IFERROR(IF(AK54=1,\"Saída do Salão\",\"Retorno ao Salão\"),\"Primeira Entrada\")","v":"Retorno ao Salão"},null,null,null,null,"|","Tempo fora do salão:",null,null,null,null,null,{"$f":"IF(J12=\"Retorno ao Salão\",E12-VLOOKUP(R9,historico!A:E,5,0),\"Não saiu\")","v":"00:21:17.620"},null,null,"|",{"$f":"IF(J12=\"Primeira Entrada\",\"Primeiro registro no sistema\",VLOOKUP(AJ12,F27:G46,2,0)&\" Registro no Sistema\")","v":"Décimo Terceiro Registro no Sistema"},null,null,null,null,null,null,null,null,"|",{"$f":"IF(J12=\"Primeira Entrada\",1,VLOOKUP(R9,historico!A:F,6,0)+1)","v":13}]
[]
[{"$f":"Y9","v":""}]
[]
[]
[]
[{"$f":"IF(H9=\"\",\"\",J12)","v":""}]
[]
[]
[]
[]
[]
[null,"Planilha criada por Adriel Staudt Schardong - Uso Exclusivo Semana Acadêmica URI Cerro Largo - Direitos Reservados."]
[]
[]
[null,null,null,null,null,1,"Primeiro"]
[null,null,null,null,null,2,"Segundo"]
[null,null,null,null,null,3,"Terceiro"]
[null,null,null,null,null,4,"Quarto"]
[null,null,null,null,null,5,"Quinto"]
[null,null,null,null,null,6,"Sexto"]
[null,null,null,null,null,7,"Sétimo"]
[null,null,null,null,null,8,"Oitavo"]
[null,null,null,null,null,9,"Nono"]
[null,null,null,null,null,10,"Décimo"]
[null,null,null,null,null,11,{"$f":"$G$36&\" \"&G27","v":"Décimo Primeiro"}]
[null,null,null,null,null,12,{"$f":"$G$36&\" \"&G28","v":"Décimo Segundo"}]
[null,null,null,null,null,13,"Décimo Terceiro"]
[null,null,null,null,null,14,"Décimo Quarto"]
[null,null,null,null,null,15,"Décimo Quinto"]
[null,null,null,null,null,16,"Décimo Sexto"]
[null,null,null,null,null,17,"Décimo Sétimo"]
[null,null,null,null,null,18,"Décimo Oitavo"]
[null,null,null,null,null,19,"Décimo Nono"]
[null,null,null,null,null,20,"Vigésimo"]
[]
[]
[]
[]
[null,null,null,null,null,null,null,null,null,null,null,null,null,null,null,null,null,null,null,null,null,null,null,null,null,null,null,null,null,null,null,null,null,null,null,null,{"$f":"IF(VLOOKUP(R9,historico!A:D,4,0)=\"Primeira Entrada\",1,0)","v":0}]
[null,null,null,null,null,null,null,null,null,null,null,null,null,null,null,null,null,null,null,null,null,null,null,null,null,null,null,null,null,null,null,null,null,null,null,null,{"$f":"IF(VLOOKUP(R9,historico!A:D,4,0)=\"Retorno ao Salão\",1,0)","v":0}]
[null,null,null,null,null,null,null,null,null,null,null,null,null,null,null,null,null,null,null,null,null,null,null,null,null,null,null,null,null,null,null,null,null,null,null,null,{"$f":"IF(VLOOKUP(R9,historico!A:D,4,0)=\"Saída do Salão\",2,0)","v":2}]
[null,null,null,null,null,null,null,null,null,null,null,null,null,null,null,null,null,null,null,null,null,null,null,null,null,null,null,null,null,null,null,null,null,null,null,null,{"$f":"SUM(AK51:AK53)","v":2}]

{"sheet":"dados_cadastros","index":2,"n_rows":261,"n_cols":4,"rows_kept":261,"cut":false,"hidden":false,"merged":[]}
["Código Barras","Cadastro","Nome","Inscrito em"]
[1136,1136,"ADRIANA ARLETE WEISHEIT","2014-05-29"]
[1188,1188,"ADRIANO JOSÉ WELTER","2014-05-26"]
[1204,1204,"ADRIELI WINTER","2014-05-21"]
[979,979,"ALEX JUNIOR CABRAL PEREIRA","2014-05-15"]
[983,983,"ALEX VOGEL","2014-05-15"]
[1039,1039,"ALEXANDRE BOHNENBERGER","2014-05-15"]
[950,950,"ALICIONE SACKS SCHEIN","2014-05-15"]
[948,948,"ALINE RATAYCZYK","2014-05-15"]
[1070,1070,"ALLAN JEISON LUNKES MAYER","2014-05-15"]
[968,968,"ALYSON RAUBER","2014-05-15"]
[1090,1090,"ANA LAURA FERREIRA","2014-05-15"]
[1043,1043,"ANDERSON KNOB","2014-05-15"]
[1143,1143,"ANDERSON LUI\u008dS DO CARMO","2014-05-15"]
[1054,1054,"ANELISE SACKS SCHEIN","2014-05-15"]
[1056,1056,"ÂNGELA CAROLINE DAMKE","2014-05-15"]
[748,748,"ANGÉLICA HAAS","2014-05-15"]
[1180,1180,"ANGÉLICA OLIVEIRA MACHADO","2014-05-15"]
[1195,1195,"ANGELICA PATRICIA WELTER","2014-05-15"]
[993,993,"ANGELICA REICHERT THOMAS","2014-05-15"]
[1125,1125,"AUGUSTO GRIEBELER SCHMIDT","2014-05-15"]
[1071,1071,"BEATRIZ SCHUQUEL ESPINDOLA","2014-05-15"]
[955,955,"BRUNA SCHLOTEFELDT","2014-05-15"]
[1058,1058,"CAMILA KERN LUNARDI","2014-05-15"]
[1072,1072,"CAMILA WELTER BRUM","2014-05-15"]
[1149,1149,"CARLA MUMBACH","2014-05-15"]
[1002,1002,"CARLA VOGEL","2014-05-15"]
[1190,1190,"CARLOS EDUARDO JACONI","2014-05-15"]
[949,949,"CAROLINA MUDERS","2014-05-15"]
[1038,1038,"CAROLINA OLIVEIRA SCHMATZ","2014-05-15"]
[959,959,"CAROLINE ZOTT","2014-05-14"]
[1066,1066,"CLARICIO DAMKE","2014-05-14"]
[1148,1148,"CLÍ\u0081UDIA RAFAELA SCHNEIDERS","2014-05-14"]
[1097,1097,"CLEISE ELIZANE THEOBALD BOTH","2014-05-14"]
[1192,1192,"CLEUSA LIDIANE BOTH","2014-05-14"]
[1012,1012,"DAIANE BRATZ","2014-05-14"]
[1075,1075,"DANIEL LUIZ BIEGER","2014-05-14"]
[1144,1144,"DANIELA DE LEMOS NENÊ","2014-05-14"]
[969,969,"DEISI FENGLER DA SILVA","2014-05-14"]
[1004,1004,"DEISON MENIN ECKERLEBEN","2014-05-14"]
[1187,1187,"DIOGO MARTIN GOTTARDO","2014-05-14"]
[1181,1181,"ELIESER HISTER","2014-05-14"]
[1052,1052,"ELISA OLIVEIRA DE MENEZES KRAMER","2014-05-14"]
[1102,1102,"ELVIS ANDRÉ SCHUQUEL RANGEL","2014-05-14"]
[1142,1142,"EVAIR SCHUMACHER FRANKUKOSKI","2014-05-14"]
[929,929,"EVERTON DA ROSA","2014-05-14"]
[1117,1117,"EVERTON LUIS WISNIEWSKI","2014-05-14"]
[1046,1046,"FÍ\u0081BIO LUÍ\u008dS KLASSMANN","2014-05-14"]
[976,976,"FERNANDA REJANE FLORIANO","2014-05-14"]
[1165,1165,"FRANCIELI MUMBACH","2014-05-14"]
[963,963,"GABRIEL FELIPE ROOS","2014-05-14"]
[896,896,"GEOVANE LUNKES","2014-05-14"]
[1200,1200,"GUILHERME MATIAS DE FREITAS","2014-05-14"]
[1015,1015,"GUSTAVO BACK","2014-05-14"]
[891,891,"GUSTAVO HENRIQUE MUMBACH","2014-05-14"]
[945,945,"ICARO GILMAR DA SILVA DE SOUZA","2014-05-14"]
[1132,1132,"IVAN JOSÉ DONEL","2014-05-14"]
[935,935,"JEFERSON SCHIRMER DA SILVA","2014-05-14"]
[1073,1073,"JÉSSICA HENDGES","2014-05-14"]
[1018,1018,"JESSICA JULIANE HOFF","2014-05-14"]
[1119,1119,"JOHN FREDDIE BERGMANN WASTOWSKI","2014-05-14"]
[1110,1110,"JORGE LEANDRO SANDER","2014-05-13"]
[1027,1027,"JOSÉ CRISTIANO KUHN","2014-05-13"]
[1121,1121,"JURANDIR VOLKMER","2014-05-13"]
[924,924,"KATIA KLEIN ANSCHAU","2014-05-13"]
[1084,1084,"KELIN SMIT","2014-05-13"]
[1089,1089,"KELLY REISDORFER","2014-05-13"]
[982,982,"LAÍ\u008dSE REGINA HERRMANN","2014-05-13"]
[1048,1048,"LARISSA FANK","2014-05-13"]
[1092,1092,"LESSANDRA PATRICIA ZABOLOTSKY","2014-05-13"]
[1003,1003,"LUANA THEISEN","2014-05-13"]
[940,940,"LUANA WINTER","2014-05-13"]
[1168,1168,"LUCAS IVAN GRIMM","2014-05-13"]
[909,909,"LUCAS MUMBACH","2014-05-13"]
[825,825,"LUCAS RECH","2014-05-13"]
[1059,1059,"LUCÉLIA SELBACH","2014-05-13"]
[1189,1189,"LUÍ\u008dS FERNANDO HAAS","2014-05-13"]
[1137,1137,"LUIZE WERLE","2014-05-13"]
[1209,1209,"MARIA ANGELITA DOS SANTOS BECKER"]
[1064,1064,"MARIELI CRISTINA DA ROSA BECKER","2014-05-13"]
[954,954,"MARISA ANGELICA DE GRAAUW","2014-05-13"]
[1202,1202,"MARISA JAROCZEWSKI DOGONSKI","2014-05-13"]
[980,980,"MARISETE CATARINA SCHERBAK","2014-05-13"]
[1099,1099,"MARLISE TERESINHA RECKTENWALDT","2014-05-13"]
[1045,1045,"MATHEUS DUGATTO","2014-05-13"]
[931,931,"MAURÍ\u008dCIO LUFT","2014-05-13"]
[1203,1203,"MURILO HENRIQUE WENZEL","2014-05-12"]
[1122,1122,"NADIRLEI MACHADO MEDEIROS","2014-05-12"]
[1080,1080,"NATAN HISTER DE OLIVEIRA","2014-05-12"]
[1120,1120,"PATRIK ANDERSON NAST","2014-05-12"]
[1011,1011,"PAULO CASSIANO HEIL","2014-05-12"]
[952,952,"RAFAEL KAPELINSKI STRAUB","2014-05-12"]
[1017,1017,"RODRIGO GIORDANI DOS SANTOS","2014-05-12"]
[1135,1135,"RODRIGO HECK"]
[1199,1199,"SADI FIGUEIREDO NENE","2014-05-12"]
[970,970,"SAMARA TAÍ\u008dS STEINMETZ","2014-05-12"]
[1191,1191,"SAMIA KOWALCZUK AMINE BATISTA","2014-05-12"]
[1062,1062,"SHEILA WILLE","2014-05-12"]
[1198,1198,"TERESINHA INÊS DEWES STEFFENS","2014-05-12"]
[1172,1172,"VALÉRIA ROSA DOS SANTOS","2014-05-12"]
[951,951,"VANESSA SALLET","2014-05-12"]
[1093,1093,"VICTOR STEINBRENNER SCHRÍ–PFER","2014-05-12"]
[1206,1206,"VIVIANE THEISEN","2014-05-12"]
[1141,1141,"ADRIANA KREWER","2014-05-12"]
[937,937,"ADRIANA PAULA GIEHL ADAMS","2014-05-12"]
[798,798,"ADRIANA WERLE SPIES","2014-05-12"]
[788,788,"ADRIEL STAUDT SCHARDONG","2014-05-12"]
[1185,1185,"ALESSANDRA KRAMER BUTZEN","2014-05-12"]
[989,989,"ALEX GALLAS","2014-05-12"]
[823,823,"ALEXANDRE OST ALMEIDA","2014-05-12"]
[828,828,"ALINE ANGÉLICA DEWES","2014-05-12"]
[861,861,"ALINE REIS ROHDEN","2014-05-12"]
[851,851,"ANA IRACEMA VIER","2014-05-12"]
[1008,1008,"ANDIARA PETRY MACHADO","2014-05-12"]
[1184,1184,"ANDRE WASTOWSKI AIRES","2014-05-12"]
[1096,1096,"ANDREI LUIZ MELCHIORS","2014-05-12"]
[1105,1105,"ANDRÉIA LÊCIA SOUTO DA CRUZ","2014-05-12"]
[984,984,"ANDREIA RODRIGUES DE MELO","2014-05-12"]
[1196,1196,"ANDRÉIA ZALESKI WERLE","2014-05-09"]
[932,932,"ANDRESSA BIERMANN PRESTES","2014-05-09"]
{"$rows_left_out":142}
{"sheet":"historico","index":3,"n_rows":349,"n_cols":6,"rows_kept":349,"cut":false,"hidden":false,"merged":[]}
["Código","Nome","Hora","Histórico","Hora","Número"]
[1137,"LUIZE WERLE",42146.865001620368,"Retorno ao Salão",42146.865001620368,3]
[901,"THIAGO ANTÔNIO SPOHR",42146.863918518517,"Retorno ao Salão",42146.863918518517,3]
[1137,"LUIZE WERLE",42146.86224652778,"Saída do Salão",42146.86224652778,2]
[1073,"JÉSSICA HENDGES",42146.861406365744,"Retorno ao Salão",42146.861406365744,3]
[1075,"DANIEL LUIZ BIEGER",42146.861364467593,"Retorno ao Salão",42146.861364467593,3]
[968,"ALYSON RAUBER",42146.86100034722,"Retorno ao Salão",42146.86100034722,5]
[794,"CRISTIAN TEN CATEN FROEHLICH",42146.860355902776,"Retorno ao Salão",42146.860355902776,3]
[968,"ALYSON RAUBER",42146.859738078703,"Saída do Salão",42146.859738078703,4]
[904,"SCHEILA CHASSOT",42146.859233796298,"Retorno ao Salão",42146.859233796298,3]
[1189,"LUÍ\u008dS FERNANDO HAAS",42146.858951504626,"Retorno ao Salão",42146.858951504626,3]
[904,"SCHEILA CHASSOT",42146.85779548611,"Saída do Salão",42146.85779548611,2]
[1129,"THAÍ\u008dS GOLDSCHMIDT",42146.85770439815,"Retorno ao Salão",42146.85770439815,3]
[1165,"FRANCIELI MUMBACH",42146.857584375,"Retorno ao Salão",42146.857584375,3]
[989,"ALEX GALLAS",42146.856246180556,"Saída do Salão",42146.856246180556,2]
[1189,"LUÍ\u008dS FERNANDO HAAS",42146.85621435185,"Saída do Salão",42146.85621435185,2]
[1044,"JESSICA CARINE LAUERMANN",42146.856141203702,"Retorno ao Salão",42146.856141203702,3]
[1015,"GUSTAVO BACK",42146.856097569442,"Retorno ao Salão",42146.856097569442,3]
[901,"THIAGO ANTÔNIO SPOHR",42146.855957638887,"Saída do Salão",42146.855957638887,2]
[931,"MAURÍ\u008dCIO LUFT",42146.855896643516,"Retorno ao Salão",42146.855896643516,3]
[794,"CRISTIAN TEN CATEN FROEHLICH",42146.855590624997,"Saída do Salão",42146.855590624997,2]
[1129,"THAÍ\u008dS GOLDSCHMIDT",42146.853811805559,"Saída do Salão",42146.853811805559,2]
[1165,"FRANCIELI MUMBACH",42146.853739814818,"Saída do Salão",42146.853739814818,2]
[1046,"FÍ\u0081BIO LUÍ\u008dS KLASSMANN",42146.853465046297,"Retorno ao Salão",42146.853465046297,3]
[1064,"MARIELI CRISTINA DA ROSA BECKER",42146.853050231482,"Saída do Salão",42146.853050231482,2]
[1062,"SHEILA WILLE",42146.852993171298,"Saída do Salão",42146.852993171298,2]
[949,"CAROLINA MUDERS",42146.852861458334,"Saída do Salão",42146.852861458334,2]
[1054,"ANELISE SACKS SCHEIN",42146.852720254632,"Retorno ao Salão",42146.852720254632,3]
[1046,"FÍ\u0081BIO LUÍ\u008dS KLASSMANN",42146.852608912035,"Saída do Salão",42146.852608912035,2]
[1066,"CLARICIO DAMKE",42146.852378356481,"Retorno ao Salão",42146.852378356481,3]
[748,"ANGÉLICA HAAS",42146.852229629629,"Retorno ao Salão",42146.852229629629,3]
[748,"ANGÉLICA HAAS",42146.852153472224,"Saída do Salão",42146.852153472224,2]
[1086,"LARISSE RAQUEL PANASSOWICZ",42146.851407175927,"Retorno ao Salão",42146.851407175927,3]
[1017,"RODRIGO GIORDANI DOS SANTOS",42146.85099525463,"Retorno ao Salão",42146.85099525463,3]
[1086,"LARISSE RAQUEL PANASSOWICZ",42146.850451388891,"Saída do Salão",42146.850451388891,2]
[1054,"ANELISE SACKS SCHEIN",42146.850378009258,"Saída do Salão",42146.850378009258,2]
[1066,"CLARICIO DAMKE",42146.850301273145,"Saída do Salão",42146.850301273145,2]
["","",42146.850217939813,"Saída do Salão",42146.850217939813,12]
[1044,"JESSICA CARINE LAUERMANN",42146.850145370372,"Saída do Salão",42146.850145370372,2]
[1045,"MATHEUS DUGATTO",42146.850090972221,"Saída do Salão",42146.850090972221,4]
[931,"MAURÍ\u008dCIO LUFT",42146.850032870374,"Saída do Salão",42146.850032870374,2]
[1015,"GUSTAVO BACK",42146.849966435184,"Saída do Salão",42146.849966435184,2]
["","",42146.849653356483,"Retorno ao Salão",42146.849653356483,11]
[1017,"RODRIGO GIORDANI DOS SANTOS",42146.849619328706,"Saída do Salão",42146.849619328706,2]
[1145,"GUILHERME JOSÉ KONZEN",42146.849559606482,"Retorno ao Salão",42146.849559606482,5]
[824,"GLAUCIA SCHMITT LEWANDOWSKI",42146.849488657404,"Retorno ao Salão",42146.849488657404,5]
[1145,"GUILHERME JOSÉ KONZEN",42146.847813541666,"Saída do Salão",42146.847813541666,4]
[1172,"VALÉRIA ROSA DOS SANTOS",42146.847592361111,"Retorno ao Salão",42146.847592361111,3]
[1192,"CLEUSA LIDIANE BOTH",42146.847526041667,"Retorno ao Salão",42146.847526041667,3]
[1192,"CLEUSA LIDIANE BOTH",42146.847443402781,"Saída do Salão",42146.847443402781,2]
[824,"GLAUCIA SCHMITT LEWANDOWSKI",42146.847021296293,"Saída do Salão",42146.847021296293,4]
[924,"KATIA KLEIN ANSCHAU",42146.846939699077,"Saída do Salão",42146.846939699077,2]
[918,"SILVANE INÊS THEWES",42146.846822800922,"Retorno ao Salão",42146.846822800922,3]
[1073,"JÉSSICA HENDGES",42146.846059722222,"Saída do Salão",42146.846059722222,2]
[1075,"DANIEL LUIZ BIEGER",42146.845989004629,"Saída do Salão",42146.845989004629,2]
[875,"GILVANO DA ROSA",42146.845916666665,"Retorno ao Salão",42146.845916666665,3]
[875,"GILVANO DA ROSA",42146.845855555555,"Saída do Salão",42146.845855555555,2]
[875,"GILVANO DA ROSA",42146.845650115742,"Primeira Entrada",42146.845650115742,1]
[999,"JÉSSICA BERWALD ROSIN",42146.845234259257,"Retorno ao Salão",42146.845234259257,5]
[1172,"VALÉRIA ROSA DOS SANTOS",42146.844791550924,"Saída do Salão",42146.844791550924,2]
[918,"SILVANE INÊS THEWES",42146.844578819444,"Saída do Salão",42146.844578819444,2]
[909,"LUCAS MUMBACH",42146.844151736113,"Saída do Salão",42146.844151736113,2]
[909,"LUCAS MUMBACH",42146.843857175925,"Primeira Entrada",42146.843857175925,1]
[999,"JÉSSICA BERWALD ROSIN",42146.842502777778,"Saída do Salão",42146.842502777778,4]
[997,"KELLYN FABIANI KONZEN DE FREITAS",42146.842083333337,"Retorno ao Salão",42146.842083333337,3]
[1023,"CARINE SCHIRMER",42146.839533333332,"Retorno ao Salão",42146.839533333332,3]
[1193,"GABRIELA SELVINO PEREIRA",42146.839502314811,"Retorno ao Salão",42146.839502314811,3]
[1156,"CAROLINA SCHOFFEN",42146.839461111114,"Retorno ao Salão",42146.839461111114,3]
[963,"GABRIEL FELIPE ROOS",42146.838757175923,"Retorno ao Salão",42146.838757175923,3]
[963,"GABRIEL FELIPE ROOS",42146.838630787039,"Saída do Salão",42146.838630787039,2]
[1151,"JAYNE DE MATOS RAMOS",42146.838288425926,"Retorno ao Salão",42146.838288425926,3]
[1163,"JULIANA THAÍ\u008dS GRÍ\u0081S DOS SANTOS MUMBACH",42146.838198263889,"Retorno ao Salão",42146.838198263889,3]
[1163,"JULIANA THAÍ\u008dS GRÍ\u0081S DOS SANTOS MUMBACH",42146.837926273147,"Saída do Salão",42146.837926273147,2]
[1151,"JAYNE DE MATOS RAMOS",42146.837531828707,"Saída do Salão",42146.837531828707,2]
[1070,"ALLAN JEISON LUNKES MAYER",42146.837285995367,"Retorno ao Salão",42146.837285995367,3]
[1025,"JUNIOR RAFAEL LENZ",42146.837255902778,"Saída do Salão",42146.837255902778,2]
[1142,"EVAIR SCHUMACHER FRANKUKOSKI",42146.837181944444,"Retorno ao Salão",42146.837181944444,3]
[1191,"SAMIA KOWALCZUK AMINE BATISTA",42146.836575925925,"Primeira Entrada",42146.836575925925,1]
[1142,"EVAIR SCHUMACHER FRANKUKOSKI",42146.836499421297,"Saída do Salão",42146.836499421297,2]
[997,"KELLYN FABIANI KONZEN DE FREITAS",42146.836434837962,"Saída do Salão",42146.836434837962,2]
[794,"CRISTIAN TEN CATEN FROEHLICH",42146.836308449077,"Primeira Entrada",42146.836308449077,1]
[887,"ANGELICA MARIA KONZEN",42146.836246412036,"Primeira Entrada",42146.836246412036,1]
[1023,"CARINE SCHIRMER",42146.835057523145,"Saída do Salão",42146.835057523145,2]
[1156,"CAROLINA SCHOFFEN",42146.834997800928,"Saída do Salão",42146.834997800928,2]
[1193,"GABRIELA SELVINO PEREIRA",42146.834942476853,"Saída do Salão",42146.834942476853,2]
["","",42146.834903935189,"Saída do Salão",42146.834903935189,10]
["","",42146.834704629633,"Retorno ao Salão",42146.834704629633,9]
[1080,"NATAN HISTER DE OLIVEIRA",42146.834688425923,"Retorno ao Salão",42146.834688425923,3]
[1080,"NATAN HISTER DE OLIVEIRA",42146.833904050924,"Saída do Salão",42146.833904050924,2]
["","",42146.830476041665,"Saída do Salão",42146.830476041665,8]
[1070,"ALLAN JEISON LUNKES MAYER",42146.830440162033,"Saída do Salão",42146.830440162033,2]
[1132,"IVAN JOSÉ DONEL",42146.830084259258,"Retorno ao Salão",42146.830084259258,5]
[1122,"NADIRLEI MACHADO MEDEIROS",42146.828113194446,"Primeira Entrada",42146.828113194446,1]
[1202,"MARISA JAROCZEWSKI DOGONSKI",42146.827464351853,"Retorno ao Salão",42146.827464351853,3]
[1202,"MARISA JAROCZEWSKI DOGONSKI",42146.824300462962,"Saída do Salão",42146.824300462962,2]
[897,"LUCAS SILVA SOARES DE OLIVEIRA",42146.823447916664,"Primeira Entrada",42146.823447916664,1]
[860,"ARTUR GIACOMELLI SPOHR",42146.822699999997,"Saída do Salão",42146.822699999997,2]
[1015,"GUSTAVO BACK",42146.822613194447,"Primeira Entrada",42146.822613194447,1]
[950,"ALICIONE SACKS SCHEIN",42146.822377662036,"Retorno ao Salão",42146.822377662036,5]
[1008,"ANDIARA PETRY MACHADO",42146.822314004632,"Primeira Entrada",42146.822314004632,1]
[950,"ALICIONE SACKS SCHEIN",42146.822238773151,"Saída do Salão",42146.822238773151,4]
[1145,"GUILHERME JOSÉ KONZEN",42146.822149305553,"Retorno ao Salão",42146.822149305553,3]
[825,"LUCAS RECH",42146.821266435189,"Retorno ao Salão",42146.821266435189,3]
[825,"LUCAS RECH",42146.821177662037,"Saída do Salão",42146.821177662037,2]
[968,"ALYSON RAUBER",42146.82108425926,"Retorno ao Salão",42146.82108425926,3]
[968,"ALYSON RAUBER",42146.821014930552,"Saída do Salão",42146.821014930552,2]
["","",42146.820925578701,"Retorno ao Salão",42146.820925578701,7]
[925,"RENAN VALDIR BACKES",42146.820787615739,"Primeira Entrada",42146.820787615739,1]
[1069,"CASSIA LENZ DOS SANTOS",42146.820495601853,"Primeira Entrada",42146.820495601853,1]
[1132,"IVAN JOSÉ DONEL",42146.819907986108,"Saída do Salão",42146.819907986108,4]
[825,"LUCAS RECH",42146.819825810184,"Primeira Entrada",42146.819825810184,1]
[935,"JEFERSON SCHIRMER DA SILVA",42146.819535300929,"Primeira Entrada",42146.819535300929,1]
[1096,"ANDREI LUIZ MELCHIORS",42146.818626967593,"Primeira Entrada",42146.818626967593,1]
[986,"VÂNIOS RODRIGO ANDRZEJEWSKI ZORZO",42146.818579166669,"Primeira Entrada",42146.818579166669,1]
[1043,"ANDERSON KNOB",42146.818346412037,"Primeira Entrada",42146.818346412037,1]
[1052,"ELISA OLIVEIRA DE MENEZES KRAMER",42146.8182787037,"Retorno ao Salão",42146.8182787037,3]
[1145,"GUILHERME JOSÉ KONZEN",42146.818205555559,"Saída do Salão",42146.818205555559,2]
[1024,"TAILENE LENZ",42146.818129398147,"Primeira Entrada",42146.818129398147,1]
[1041,"LIZIANE MARLIZE DE LIMA NASCIMENTO",42146.818090856483,"Primeira Entrada",42146.818090856483,1]
[1168,"LUCAS IVAN GRIMM",42146.818039814818,"Primeira Entrada",42146.818039814818,1]
{"$rows_left_out":230}
{"sheet":"cola","index":4,"n_rows":2,"n_cols":6,"rows_kept":2,"cut":false,"hidden":false,"merged":[]}
[{"$f":"index!R9","v":""},{"$f":"index!Y9","v":""},{"$f":"index!E12","v":"2015-05-22T20:45:36.450"},{"$f":"index!J12","v":"Retorno ao Salão"},{"$f":"index!E12","v":"2015-05-22T20:45:36.450"},{"$f":"index!AJ12","v":13}]
[1137,"LUIZE WERLE",42146.865001620368,"Retorno ao Salão",42146.865001620368,3]